Information card for entry 4068867
Formula | C18 H23 Au Cl2 N O P |
Calculated formula | C18 H23 Au Cl2 N O P |
SMILES | [Au]1(Cl)(Cl)[O]=P(N(C(C)C)C(C)C)(c2c1cccc2)c1ccccc1 |
Title of publication | An Unprecedented Phosphinamidic Gold(III) Metallocycle: Synthesis via Tin(IV) Precursors, Structure, and Multicomponent Catalysis |
Authors of publication | Oña-Burgos, Pascual; Fernández, Ignacio; Roces, Laura; Torre Fernández, Laura; García-Granda, Santiago; López Ortiz, Fernando |
Journal of publication | Organometallics |
Year of publication | 2009 |
Journal volume | 28 |
Journal issue | 6 |
Pages of publication | 1739 |
a | 16.6228 ± 0.0003 Å |
b | 9.0976 ± 0.0001 Å |
c | 15.5802 ± 0.0003 Å |
α | 90° |
β | 120.004 ± 0.001° |
γ | 90° |
Cell volume | 2040.41 ± 0.06 Å3 |
Cell temperature | 293 ± 2 K |
Ambient diffraction temperature | 293 ± 2 K |
Number of distinct elements | 7 |
Space group number | 9 |
Hermann-Mauguin space group symbol | C 1 c 1 |
Hall space group symbol | C -2yc |
Residual factor for all reflections | 0.0212 |
Residual factor for significantly intense reflections | 0.0202 |
Weighted residual factors for significantly intense reflections | 0.0505 |
Weighted residual factors for all reflections included in the refinement | 0.0681 |
Goodness-of-fit parameter for all reflections included in the refinement | 1.325 |
Diffraction radiation probe | x-ray |
Diffraction radiation wavelength | 1.54184 Å |
Diffraction radiation type | CuKα |