Information card for entry 4075692
Formula | C60 H62 Cl8 O8 P2 Pd2 |
Calculated formula | C60 H60 Cl8 O8 P2 Pd2 |
Title of publication | Investigations of Benzyl and Aryl Palladium Complexes with Pendant Hydroxy Substituents and Their Transformation into Benzolactones on Carbonylation |
Authors of publication | Lindsell, W. Edward; Palmer, Daniel D.; Preston, Peter N.; Rosair, Georgina M.; Jones, Ray V. H.; Whitton, Alan J. |
Journal of publication | Organometallics |
Year of publication | 2005 |
Journal volume | 24 |
Journal issue | 6 |
Pages of publication | 1119 |
a | 10.3038 ± 0.0011 Å |
b | 11.9421 ± 0.0014 Å |
c | 14.743 ± 0.002 Å |
α | 67.594 ± 0.009° |
β | 71.833 ± 0.011° |
γ | 89.336 ± 0.011° |
Cell volume | 1581.6 ± 0.4 Å3 |
Cell temperature | 160 ± 2 K |
Ambient diffraction temperature | 160 ± 2 K |
Number of distinct elements | 6 |
Space group number | 2 |
Hermann-Mauguin space group symbol | P -1 |
Hall space group symbol | -P 1 |
Residual factor for all reflections | 0.0544 |
Residual factor for significantly intense reflections | 0.0435 |
Weighted residual factors for significantly intense reflections | 0.1061 |
Weighted residual factors for all reflections included in the refinement | 0.1119 |
Goodness-of-fit parameter for all reflections included in the refinement | 1.059 |
Diffraction radiation wavelength | 0.71073 Å |
Diffraction radiation type | MoKα |