Information card for entry 4077161
Formula | C22 H44 B10 K O6.5 |
Calculated formula | C22 H43 B10 K O6.5 |
SMILES | [BH]123[BH]456[BH]78([BH]9%10C%11%12C3([BH]3%131[BH]124[BH]257[BH]489[BH]%10%113[BH]%13124)Cc1ccccc1C%12)[H]6.[K]12345[O]6CC[O]1CC[O]2CC[O]3CC[O]4CC[O]5CC6.O |
Title of publication | Synthesis, Structural Characterization, and Reactivity of ‘Carbons-Adjacent'nido- andarachno-Carborane Anions of the C2B10Systems and Their Metal Complexes |
Authors of publication | Zi, Guofu; Li, Hung-Wing; Xie, Zuowei |
Journal of publication | Organometallics |
Year of publication | 2002 |
Journal volume | 21 |
Journal issue | 24 |
Pages of publication | 5415 |
a | 13.253 ± 0.003 Å |
b | 11.361 ± 0.002 Å |
c | 21.675 ± 0.004 Å |
α | 90° |
β | 106.01 ± 0.03° |
γ | 90° |
Cell volume | 3137 ± 1.2 Å3 |
Cell temperature | 293 ± 2 K |
Ambient diffraction temperature | 293 ± 2 K |
Number of distinct elements | 5 |
Space group number | 14 |
Hermann-Mauguin space group symbol | P 1 21/n 1 |
Hall space group symbol | -P 2yn |
Residual factor for all reflections | 0.1839 |
Residual factor for significantly intense reflections | 0.0787 |
Weighted residual factors for significantly intense reflections | 0.2076 |
Weighted residual factors for all reflections included in the refinement | 0.2583 |
Goodness-of-fit parameter for all reflections included in the refinement | 1.007 |
Diffraction radiation wavelength | 0.71073 Å |
Diffraction radiation type | MoKα |