Information card for entry 4077162
Formula | C22 H43 B10 K O6 |
Calculated formula | C22 H43 B10 K O6 |
SMILES | [K]12345[O]6CC[O]2CC[O]1CC[O]3CC[O]4CC[O]5CC6.[C]1234[C]56(Cc7ccccc7C1)[BH]17[BH]89%10[BH]%11%12%13[BH]%1418[BH]18%11[BH]%11%12[BH]2([BH]39%13[H]%10)[BH]468%11[BH]57%141 |
Title of publication | Synthesis, Structural Characterization, and Reactivity of ‘Carbons-Adjacent'nido- andarachno-Carborane Anions of the C2B10Systems and Their Metal Complexes |
Authors of publication | Zi, Guofu; Li, Hung-Wing; Xie, Zuowei |
Journal of publication | Organometallics |
Year of publication | 2002 |
Journal volume | 21 |
Journal issue | 24 |
Pages of publication | 5415 |
a | 8.9528 ± 0.001 Å |
b | 18.667 ± 0.002 Å |
c | 18.642 ± 0.002 Å |
α | 90° |
β | 101.116 ± 0.002° |
γ | 90° |
Cell volume | 3057 ± 0.6 Å3 |
Cell temperature | 293 ± 2 K |
Ambient diffraction temperature | 293 ± 2 K |
Number of distinct elements | 5 |
Space group number | 14 |
Hermann-Mauguin space group symbol | P 1 21/n 1 |
Hall space group symbol | -P 2yn |
Residual factor for all reflections | 0.0859 |
Residual factor for significantly intense reflections | 0.0634 |
Weighted residual factors for significantly intense reflections | 0.1711 |
Weighted residual factors for all reflections included in the refinement | 0.1887 |
Goodness-of-fit parameter for all reflections included in the refinement | 1.039 |
Diffraction radiation wavelength | 0.71073 Å |
Diffraction radiation type | MoKα |