Information card for entry 4082837
Formula | C30.52 H43.3 N2 O7.13 Pd |
Calculated formula | C30.52 H43.3 N2 O7.13 Pd |
Title of publication | Heteropolymetallic Complexes Linked to a 9,10-Dihydroanthracenyl Frame. Ruthenium as Active Spectator for Palladium Reactivity |
Authors of publication | Bratko, Ielyzaveta; Mallet-Ladeira, Sonia; Teuma, Emmanuelle; Gómez, Montserrat |
Journal of publication | Organometallics |
Year of publication | 2014 |
Journal volume | 33 |
Journal issue | 7 |
Pages of publication | 1812 |
a | 23.2175 ± 0.0008 Å |
b | 23.2175 ± 0.0008 Å |
c | 12.6652 ± 0.0005 Å |
α | 90° |
β | 90° |
γ | 90° |
Cell volume | 6827.2 ± 0.4 Å3 |
Cell temperature | 193 ± 2 K |
Ambient diffraction temperature | 193 ± 2 K |
Number of distinct elements | 5 |
Space group number | 82 |
Hermann-Mauguin space group symbol | I -4 |
Hall space group symbol | I -4 |
Residual factor for all reflections | 0.0224 |
Residual factor for significantly intense reflections | 0.0216 |
Weighted residual factors for significantly intense reflections | 0.0631 |
Weighted residual factors for all reflections included in the refinement | 0.0638 |
Goodness-of-fit parameter for all reflections included in the refinement | 1.112 |
Diffraction radiation probe | x-ray |
Diffraction radiation wavelength | 0.71073 Å |
Diffraction radiation type | MoKα |