Information card for entry 4082838
Formula | C26 H34 N2 O2 |
Calculated formula | C26 H34 N2 O2 |
SMILES | c12ccccc1C1(c3ccccc3C2([C@H]2[C@@H]1CN(C2)CCN(C)C)OCC)OCC |
Title of publication | Heteropolymetallic Complexes Linked to a 9,10-Dihydroanthracenyl Frame. Ruthenium as Active Spectator for Palladium Reactivity |
Authors of publication | Bratko, Ielyzaveta; Mallet-Ladeira, Sonia; Teuma, Emmanuelle; Gómez, Montserrat |
Journal of publication | Organometallics |
Year of publication | 2014 |
Journal volume | 33 |
Journal issue | 7 |
Pages of publication | 1812 |
a | 10.2423 ± 0.0005 Å |
b | 10.4739 ± 0.0004 Å |
c | 10.7311 ± 0.0005 Å |
α | 99.827 ± 0.003° |
β | 102.098 ± 0.003° |
γ | 93.374 ± 0.003° |
Cell volume | 1103.75 ± 0.09 Å3 |
Cell temperature | 193 ± 2 K |
Ambient diffraction temperature | 193 ± 2 K |
Number of distinct elements | 4 |
Space group number | 2 |
Hermann-Mauguin space group symbol | P -1 |
Hall space group symbol | -P 1 |
Residual factor for all reflections | 0.0923 |
Residual factor for significantly intense reflections | 0.0488 |
Weighted residual factors for significantly intense reflections | 0.1279 |
Weighted residual factors for all reflections included in the refinement | 0.1705 |
Goodness-of-fit parameter for all reflections included in the refinement | 1.13 |
Diffraction radiation probe | x-ray |
Diffraction radiation wavelength | 0.71073 Å |
Diffraction radiation type | MoKα |