Information card for entry 4084051
Formula | C68 H120 Cl2 P4 Ru2 |
Calculated formula | C68 H120 Cl2 P4 Ru2 |
Title of publication | A Stable Silylene in a Reactive Environment: Synthesis, Reactivity, and Silicon Extrusion Chemistry of a Coordinatively Unsaturated Ruthenium Silylene Complex Containing Chloride and η3-P‒C‒P Ligands |
Authors of publication | Amoroso, Dino; Haaf, Michael; Yap, Glenn P. A.; West, Robert; Fogg, Deryn E. |
Journal of publication | Organometallics |
Year of publication | 2002 |
Journal volume | 21 |
Journal issue | 3 |
Pages of publication | 534 - 540 |
a | 11.2119 ± 0.0007 Å |
b | 13.619 ± 0.0009 Å |
c | 24.6084 ± 0.0016 Å |
α | 77.528 ± 0.001° |
β | 79.295 ± 0.001° |
γ | 68.667 ± 0.001° |
Cell volume | 3393.7 ± 0.4 Å3 |
Cell temperature | 203 ± 2 K |
Ambient diffraction temperature | 203 ± 2 K |
Number of distinct elements | 5 |
Space group number | 2 |
Hermann-Mauguin space group symbol | P -1 |
Hall space group symbol | -P 1 |
Residual factor for all reflections | 0.0385 |
Residual factor for significantly intense reflections | 0.0273 |
Weighted residual factors for significantly intense reflections | 0.0604 |
Weighted residual factors for all reflections included in the refinement | 0.062 |
Goodness-of-fit parameter for all reflections included in the refinement | 1.012 |
Diffraction radiation wavelength | 0.71073 Å |
Diffraction radiation type | MoKα |