Information card for entry 4085942
Formula | C50.5 H62 Ga N3 O |
Calculated formula | C50.5 H62 Ga N3 O |
Title of publication | Mononuclear dpp-Bian Gallium Complexes: Synthesis, Crystal Structures, and Reactivity toward Alkynes and Enones |
Authors of publication | Fedushkin, Igor L.; Kazarina, Olga V.; Lukoyanov, Anton N.; Skatova, Alexandra A.; Bazyakina, Natalia L.; Cherkasov, Anton V.; Palamidis, Eftimios |
Journal of publication | Organometallics |
Year of publication | 2015 |
Journal volume | 34 |
Journal issue | 8 |
Pages of publication | 1498 |
a | 14.6963 ± 0.0003 Å |
b | 19.6941 ± 0.0002 Å |
c | 16.7638 ± 0.0003 Å |
α | 90° |
β | 115.129 ± 0.002° |
γ | 90° |
Cell volume | 4392.74 ± 0.15 Å3 |
Cell temperature | 100 ± 2 K |
Ambient diffraction temperature | 100 ± 2 K |
Number of distinct elements | 5 |
Space group number | 14 |
Hermann-Mauguin space group symbol | P 1 21/n 1 |
Hall space group symbol | -P 2yn |
Residual factor for all reflections | 0.0511 |
Residual factor for significantly intense reflections | 0.0334 |
Weighted residual factors for significantly intense reflections | 0.0825 |
Weighted residual factors for all reflections included in the refinement | 0.0897 |
Goodness-of-fit parameter for all reflections included in the refinement | 1.042 |
Diffraction radiation wavelength | 0.71073 Å |
Diffraction radiation type | MoKα |