Information card for entry 4104594
Formula | C18 H24 F3 N5 O2 Pt |
Calculated formula | C18 H24 F3 N5 O2 Pt |
SMILES | C[Pt](=C1N(C=CN1C)C)(=C1N(C=CN1C)C)[n]1ccccc1.C(=O)(C(F)(F)F)[O-] |
Title of publication | Synthesis of Trimethylplatinum(IV) Complexes with N,N- and N,O-Heterocyclic Carbene Ligands and Their Reductive C-C Elimination Reactions |
Authors of publication | Ronald Lindner; Christoph Wagner; Dirk Steinborn |
Journal of publication | Journal of the American Chemical Society |
Year of publication | 2009 |
Journal volume | 131 |
Pages of publication | 8861 - 8874 |
a | 8.4462 ± 0.0009 Å |
b | 22.7597 ± 0.0018 Å |
c | 11.106 ± 0.0013 Å |
α | 90° |
β | 91.095 ± 0.013° |
γ | 90° |
Cell volume | 2134.5 ± 0.4 Å3 |
Cell temperature | 220 ± 2 K |
Ambient diffraction temperature | 220 ± 2 K |
Number of distinct elements | 6 |
Space group number | 14 |
Hermann-Mauguin space group symbol | P 1 21/c 1 |
Hall space group symbol | -P 2ybc |
Residual factor for all reflections | 0.0665 |
Residual factor for significantly intense reflections | 0.0528 |
Weighted residual factors for significantly intense reflections | 0.1206 |
Weighted residual factors for all reflections included in the refinement | 0.13 |
Goodness-of-fit parameter for all reflections included in the refinement | 1.144 |
Diffraction radiation wavelength | 0.71073 Å |
Diffraction radiation type | MoKα |