Information card for entry 4104595
Formula | C13 H24 N2 O2 Pt |
Calculated formula | C13 H24 N2 O2 Pt |
SMILES | C1(N(C=CN1C)C)=[Pt]1(C)(C)(C)[O]=C(C=C(C)O1)C |
Title of publication | Synthesis of Trimethylplatinum(IV) Complexes with N,N- and N,O-Heterocyclic Carbene Ligands and Their Reductive C-C Elimination Reactions |
Authors of publication | Ronald Lindner; Christoph Wagner; Dirk Steinborn |
Journal of publication | Journal of the American Chemical Society |
Year of publication | 2009 |
Journal volume | 131 |
Pages of publication | 8861 - 8874 |
a | 8.4637 ± 0.0017 Å |
b | 13.213 ± 0.003 Å |
c | 14.322 ± 0.003 Å |
α | 90° |
β | 95.57 ± 0.02° |
γ | 90° |
Cell volume | 1594.1 ± 0.6 Å3 |
Cell temperature | 220 ± 2 K |
Ambient diffraction temperature | 220 ± 2 K |
Number of distinct elements | 5 |
Space group number | 14 |
Hermann-Mauguin space group symbol | P 1 21/n 1 |
Hall space group symbol | -P 2yn |
Residual factor for all reflections | 0.0752 |
Residual factor for significantly intense reflections | 0.0662 |
Weighted residual factors for significantly intense reflections | 0.1554 |
Weighted residual factors for all reflections included in the refinement | 0.1626 |
Goodness-of-fit parameter for all reflections included in the refinement | 1.072 |
Diffraction radiation wavelength | 0.71073 Å |
Diffraction radiation type | MoKα |