Information card for entry 4104617
Formula | C20 H19 Au F6 N5 P |
Calculated formula | C22 H8 Au F6 N3 P |
Title of publication | Luminescent Cyclometalated N-Heterocyclic Carbene-Containing Organogold(III) Complexes: Synthesis, Characterization, Electrochemistry, and Photophysical Studies |
Authors of publication | Vonika Ka-Man Au; Keith Man-Chung Wong; Nianyong Zhu; Vivian Wing-Wah Yam |
Journal of publication | Journal of the American Chemical Society |
Year of publication | 2009 |
Journal volume | 131 |
Pages of publication | 9076 - 9085 |
a | 12.22 ± 0.002 Å |
b | 11.51 ± 0.002 Å |
c | 15.874 ± 0.003 Å |
α | 90° |
β | 90° |
γ | 90° |
Cell volume | 2232.7 ± 0.7 Å3 |
Cell temperature | 253 ± 2 K |
Ambient diffraction temperature | 253 ± 2 K |
Number of distinct elements | 6 |
Space group number | 57 |
Hermann-Mauguin space group symbol | P b c m |
Hall space group symbol | -P 2c 2b |
Residual factor for all reflections | 0.0358 |
Residual factor for significantly intense reflections | 0.0317 |
Weighted residual factors for significantly intense reflections | 0.0792 |
Weighted residual factors for all reflections included in the refinement | 0.0808 |
Goodness-of-fit parameter for all reflections included in the refinement | 1.073 |
Diffraction radiation wavelength | 0.71073 Å |
Diffraction radiation type | MoKα |