Information card for entry 4104618
Formula | C30 H35 Au F6 N3 P |
Calculated formula | C30 H35 Au F6 N3 P |
Title of publication | Luminescent Cyclometalated N-Heterocyclic Carbene-Containing Organogold(III) Complexes: Synthesis, Characterization, Electrochemistry, and Photophysical Studies |
Authors of publication | Vonika Ka-Man Au; Keith Man-Chung Wong; Nianyong Zhu; Vivian Wing-Wah Yam |
Journal of publication | Journal of the American Chemical Society |
Year of publication | 2009 |
Journal volume | 131 |
Pages of publication | 9076 - 9085 |
a | 14.153 ± 0.002 Å |
b | 23.683 ± 0.004 Å |
c | 28.211 ± 0.005 Å |
α | 90° |
β | 90° |
γ | 90° |
Cell volume | 9456 ± 3 Å3 |
Cell temperature | 301 ± 2 K |
Ambient diffraction temperature | 301 ± 2 K |
Number of distinct elements | 6 |
Space group number | 24 |
Hermann-Mauguin space group symbol | I 21 21 21 |
Hall space group symbol | I 2b 2c |
Residual factor for all reflections | 0.0367 |
Residual factor for significantly intense reflections | 0.0328 |
Weighted residual factors for significantly intense reflections | 0.0917 |
Weighted residual factors for all reflections included in the refinement | 0.0951 |
Goodness-of-fit parameter for all reflections included in the refinement | 1.086 |
Diffraction radiation wavelength | 0.71073 Å |
Diffraction radiation type | MoKα |