Information card for entry 4104619
Formula | C26 H21 Au F6 N3 P |
Calculated formula | C26 H21 Au F6 N3 P |
SMILES | CN1C(=[Au]23c4ccccc4c4cccc(c5c2cccc5)[n]34)N(C)c2c1cccc2.[P](F)(F)(F)(F)(F)[F-] |
Title of publication | Luminescent Cyclometalated N-Heterocyclic Carbene-Containing Organogold(III) Complexes: Synthesis, Characterization, Electrochemistry, and Photophysical Studies |
Authors of publication | Vonika Ka-Man Au; Keith Man-Chung Wong; Nianyong Zhu; Vivian Wing-Wah Yam |
Journal of publication | Journal of the American Chemical Society |
Year of publication | 2009 |
Journal volume | 131 |
Pages of publication | 9076 - 9085 |
a | 12.332 ± 0.002 Å |
b | 7.8178 ± 0.001 Å |
c | 25.914 ± 0.004 Å |
α | 90° |
β | 102.07 ± 0.02° |
γ | 90° |
Cell volume | 2443.1 ± 0.7 Å3 |
Cell temperature | 301 ± 2 K |
Ambient diffraction temperature | 301 ± 2 K |
Number of distinct elements | 6 |
Space group number | 14 |
Hermann-Mauguin space group symbol | P 1 21/n 1 |
Hall space group symbol | -P 2yn |
Residual factor for all reflections | 0.0249 |
Residual factor for significantly intense reflections | 0.0224 |
Weighted residual factors for significantly intense reflections | 0.0556 |
Weighted residual factors for all reflections included in the refinement | 0.0567 |
Goodness-of-fit parameter for all reflections included in the refinement | 1.052 |
Diffraction radiation wavelength | 0.71073 Å |
Diffraction radiation type | MoKα |