Information card for entry 4104648
Formula | C14 H18 O3 S |
Calculated formula | C14 H18 O3 S |
SMILES | S(=O)(=O)(C1=C[C@@H](O)CCC[C@@H]1C)c1ccccc1 |
Title of publication | Reagent-Directed Allylic Quadraselection. Chemoselective Anti- and Syn-Lawton SN2' Methylation of Seven-Membered Epoxyvinylsulfones |
Authors of publication | Wan Pyo Hong; Ahmad El-Awa; Philip L. Fuchs |
Journal of publication | Journal of the American Chemical Society |
Year of publication | 2009 |
Journal volume | 131 |
Pages of publication | 9150 - 9151 |
a | 10.5248 ± 0.0013 Å |
b | 11.1963 ± 0.0006 Å |
c | 11.4028 ± 0.0006 Å |
α | 90° |
β | 90° |
γ | 90° |
Cell volume | 1343.69 ± 0.19 Å3 |
Cell temperature | 150 K |
Ambient diffraction temperature | 150 K |
Number of distinct elements | 4 |
Space group number | 19 |
Hermann-Mauguin space group symbol | P 21 21 21 |
Hall space group symbol | P 2ac 2ab |
Residual factor for all reflections | 0.043 |
Residual factor for significantly intense reflections | 0.033 |
Weighted residual factors for significantly intense reflections | 0.077 |
Weighted residual factors for all reflections included in the refinement | 0.08 |
Goodness-of-fit parameter for all reflections included in the refinement | 1.07 |
Diffraction radiation wavelength | 0.71073 Å |
Diffraction radiation type | MO-Kα |