Information card for entry 4104647
Formula | C21 H34 O4 S Si |
Calculated formula | C21 H34 O4 S Si |
SMILES | S(=O)(=O)(C1=C[C@@H](O)[C@H]([C@@H](O[Si](C(C)(C)C)(C)C)C[C@@H]1C)C)c1ccccc1 |
Title of publication | Reagent-Directed Allylic Quadraselection. Chemoselective Anti- and Syn-Lawton SN2' Methylation of Seven-Membered Epoxyvinylsulfones |
Authors of publication | Wan Pyo Hong; Ahmad El-Awa; Philip L. Fuchs |
Journal of publication | Journal of the American Chemical Society |
Year of publication | 2009 |
Journal volume | 131 |
Pages of publication | 9150 - 9151 |
a | 10.4714 ± 0.0009 Å |
b | 8.9475 ± 0.0006 Å |
c | 13.4056 ± 0.0016 Å |
α | 90° |
β | 111.345 ± 0.005° |
γ | 90° |
Cell volume | 1169.85 ± 0.19 Å3 |
Cell temperature | 150 K |
Ambient diffraction temperature | 150 K |
Number of distinct elements | 5 |
Space group number | 4 |
Hermann-Mauguin space group symbol | P 1 21 1 |
Hall space group symbol | P 2yb |
Residual factor for all reflections | 0.058 |
Residual factor for significantly intense reflections | 0.049 |
Weighted residual factors for significantly intense reflections | 0.123 |
Weighted residual factors for all reflections included in the refinement | 0.129 |
Goodness-of-fit parameter for all reflections included in the refinement | 1.035 |
Diffraction radiation wavelength | 0.71073 Å |
Diffraction radiation type | MO-Kα |