Information card for entry 4108270
Common name | MOF-114 |
Formula | C37 H37 N3 O15 S2 Zn2 |
Calculated formula | C37 H37 N3 O15 S2 Zn2 |
Title of publication | Control of Vertex Geometry, Structure Dimensionality, Functionality, and Pore Metrics in the Reticular Synthesis of Crystalline Metal-Organic Frameworks and Polyhedra |
Authors of publication | Hiroyasu Furukawa; Jaheon Kim; Nathan W. Ockwig; Michael O'Keeffe; Omar M. Yaghi |
Journal of publication | Journal of the American Chemical Society |
Year of publication | 2008 |
Journal volume | 130 |
Pages of publication | 11650 - 11661 |
a | 22.241 ± 0.002 Å |
b | 12.7034 ± 0.0012 Å |
c | 17.6543 ± 0.0016 Å |
α | 90° |
β | 126.361 ± 0.002° |
γ | 90° |
Cell volume | 4016.8 ± 0.6 Å3 |
Cell temperature | 258 ± 2 K |
Ambient diffraction temperature | 258 ± 2 K |
Number of distinct elements | 6 |
Space group number | 15 |
Hermann-Mauguin space group symbol | C 1 2/c 1 |
Hall space group symbol | -C 2yc |
Residual factor for all reflections | 0.0325 |
Residual factor for significantly intense reflections | 0.0284 |
Weighted residual factors for significantly intense reflections | 0.077 |
Weighted residual factors for all reflections included in the refinement | 0.079 |
Goodness-of-fit parameter for all reflections included in the refinement | 1.047 |
Diffraction radiation wavelength | 0.71073 Å |
Diffraction radiation type | MoKα |