Information card for entry 4108271
Common name | MOF-115 |
Formula | C41 H45 Cu2 N3 O11 |
Calculated formula | C41 H34 Cu2 N3 O11 |
Title of publication | Control of Vertex Geometry, Structure Dimensionality, Functionality, and Pore Metrics in the Reticular Synthesis of Crystalline Metal-Organic Frameworks and Polyhedra |
Authors of publication | Hiroyasu Furukawa; Jaheon Kim; Nathan W. Ockwig; Michael O'Keeffe; Omar M. Yaghi |
Journal of publication | Journal of the American Chemical Society |
Year of publication | 2008 |
Journal volume | 130 |
Pages of publication | 11650 - 11661 |
a | 13.22 ± 0.003 Å |
b | 15.123 ± 0.003 Å |
c | 11.734 ± 0.002 Å |
α | 90° |
β | 105.673 ± 0.005° |
γ | 90° |
Cell volume | 2258.7 ± 0.8 Å3 |
Cell temperature | 258 ± 2 K |
Ambient diffraction temperature | 258 ± 2 K |
Number of distinct elements | 5 |
Space group number | 12 |
Hermann-Mauguin space group symbol | C 1 2/m 1 |
Hall space group symbol | -C 2y |
Residual factor for all reflections | 0.0794 |
Residual factor for significantly intense reflections | 0.0611 |
Weighted residual factors for significantly intense reflections | 0.1651 |
Weighted residual factors for all reflections included in the refinement | 0.1777 |
Goodness-of-fit parameter for all reflections included in the refinement | 1.106 |
Diffraction radiation wavelength | 0.71073 Å |
Diffraction radiation type | MoKα |