Information card for entry 4108272
Common name | MOF-116 |
Formula | C60 H50 Cu2 N4 O11 |
Calculated formula | C54 H34 Cu2 N2 O8 |
Title of publication | Control of Vertex Geometry, Structure Dimensionality, Functionality, and Pore Metrics in the Reticular Synthesis of Crystalline Metal-Organic Frameworks and Polyhedra |
Authors of publication | Hiroyasu Furukawa; Jaheon Kim; Nathan W. Ockwig; Michael O'Keeffe; Omar M. Yaghi |
Journal of publication | Journal of the American Chemical Society |
Year of publication | 2008 |
Journal volume | 130 |
Pages of publication | 11650 - 11661 |
a | 13.7184 ± 0.0013 Å |
b | 20.3881 ± 0.0018 Å |
c | 9.3906 ± 0.0009 Å |
α | 90° |
β | 93.442 ± 0.004° |
γ | 90° |
Cell volume | 2621.7 ± 0.4 Å3 |
Cell temperature | 233 ± 2 K |
Ambient diffraction temperature | 233 ± 2 K |
Number of distinct elements | 5 |
Space group number | 12 |
Hermann-Mauguin space group symbol | C 1 2/m 1 |
Hall space group symbol | -C 2y |
Residual factor for all reflections | 0.1111 |
Residual factor for significantly intense reflections | 0.0821 |
Weighted residual factors for significantly intense reflections | 0.23 |
Weighted residual factors for all reflections included in the refinement | 0.2606 |
Goodness-of-fit parameter for all reflections included in the refinement | 1.002 |
Diffraction radiation wavelength | 0.71073 Å |
Diffraction radiation type | MoKα |