Information card for entry 4116339
Common name | [AgOTf(PCTD)]n |
Formula | C15 H16 Ag F3 O3 S |
Calculated formula | C15 H16 Ag F3 O3 S |
Title of publication | Novel Ruthenium Complex-Catalyzed Dimerization of 2,5-Norbornadiene to Pentacyclo[6.6.0.0^2,6^.0^3,13^.0^10,14^]tetradeca-4,11-diene Involving Carbon-Carbon Bond Cleavage |
Authors of publication | Take-aki Mitsudo; Toshiaki Suzuki; Shi-Wei Zhang; Daisuke Imai; Ken-ichi Fujita; Takao Manabe; Masashi Shiotsuki; Yoshihisa Watanabe; Kenji Wada; Teruyuki Kondo |
Journal of publication | Journal of the American Chemical Society |
Year of publication | 1999 |
Journal volume | 121 |
Journal issue | 9 |
Pages of publication | 1839 - 1850 |
a | 19.708 ± 0.004 Å |
b | 7.742 ± 0.004 Å |
c | 9.858 ± 0.004 Å |
α | 90° |
β | 90° |
γ | 90° |
Cell volume | 1504.1 ± 1 Å3 |
Cell temperature | 296.2 K |
Ambient diffraction temperature | 296.2 K |
Number of distinct elements | 6 |
Space group number | 29 |
Hermann-Mauguin space group symbol | P c a 21 |
Hall space group symbol | P 2c -2ac |
Residual factor for all reflections | 0.0288 |
Residual factor for significantly intense reflections | 0.0288 |
Weighted residual factors for significantly intense reflections | 0.0302 |
Weighted residual factors for all reflections included in the refinement | 0.0302 |
Goodness-of-fit parameter for all reflections included in the refinement | 1.277 |
Diffraction radiation wavelength | 0.7107 Å |
Diffraction radiation type | MoKα |