Information card for entry 4116340
Common name | Ru(cot)(dmfm)2 |
Formula | C20 H26 O8 Ru |
Calculated formula | C20 H26 O8 Ru |
Title of publication | Novel Ruthenium Complex-Catalyzed Dimerization of 2,5-Norbornadiene to Pentacyclo[6.6.0.02,6.03,13.010,14]tetradeca-4,11-diene Involving Carbon-Carbon Bond Cleavage |
Authors of publication | Take-aki Mitsudo; Toshiaki Suzuki; Shi-Wei Zhang; Daisuke Imai; Ken-ichi Fujita; Takao Manabe; Masashi Shiotsuki; Yoshihisa Watanabe; Kenji Wada; Teruyuki Kondo |
Journal of publication | Journal of the American Chemical Society |
Year of publication | 1999 |
Journal volume | 121 |
Journal issue | 9 |
Pages of publication | 1839 - 1850 |
a | 7.816 ± 0.005 Å |
b | 25.19 ± 0.005 Å |
c | 11.05 ± 0.006 Å |
α | 90° |
β | 109.01 ± 0.04° |
γ | 90° |
Cell volume | 2056.9 ± 1.8 Å3 |
Cell temperature | 296.2 K |
Ambient diffraction temperature | 296.2 K |
Number of distinct elements | 4 |
Space group number | 14 |
Hermann-Mauguin space group symbol | P 1 21/c 1 |
Hall space group symbol | -P 2ybc |
Residual factor for all reflections | 0 |
Residual factor for significantly intense reflections | 0 |
Weighted residual factors for significantly intense reflections | 0 |
Weighted residual factors for all reflections included in the refinement | 0.0413 |
Goodness-of-fit parameter for all reflections included in the refinement | 0.658 |
Diffraction radiation wavelength | 0.7107 Å |
Diffraction radiation type | MoKα |