Information card for entry 4116343
Formula | C6 H16 N10 Ni O6 |
Calculated formula | C6 H16 N10 Ni O6 |
Title of publication | Tunable Molecular Distortion in a Nickel Complex Coupled to a Reversible Phase Transition in the Crystalline State |
Authors of publication | Larry R. Falvello; Michael A. Hitchman; Fernando Palacio; Isabel Pascual; Arthur J. Schultz; Horst Stratemeier; Milagros Tomás; Esteban P. Urriolabeitia; Dianna M. Young |
Journal of publication | Journal of the American Chemical Society |
Year of publication | 1999 |
Journal volume | 121 |
Pages of publication | 2808 - 2819 |
a | 11.998 ± 0.004 Å |
b | 7.203 ± 0.006 Å |
c | 15.736 ± 0.005 Å |
α | 90° |
β | 90° |
γ | 90° |
Cell volume | 1359.9 ± 1.3 Å3 |
Cell temperature | 100 ± 1 K |
Ambient diffraction temperature | 100 ± 1 K |
Number of distinct elements | 5 |
Space group number | 63 |
Hermann-Mauguin space group symbol | C m c m |
Hall space group symbol | -C 2c 2 |
Residual factor for all reflections | 0.0522 |
Residual factor for significantly intense reflections | 0.0393 |
Weighted residual factors for all reflections | 0.0966 |
Weighted residual factors for significantly intense reflections | 0.0912 |
Goodness-of-fit parameter for all reflections | 1.069 |
Goodness-of-fit parameter for significantly intense reflections | 1.124 |
Diffraction radiation wavelength | 0.71073 Å |
Diffraction radiation type | MoKα |