Information card for entry 4116626
Formula | C24 H23 N O5 S |
Calculated formula | C24 H23 N O5 S |
SMILES | s1cccc1C(=O)c1ccc(cc1)[C@@H](C)C(=O)N[C@H](C(=O)OC)Cc1ccc(O)cc1 |
Title of publication | Enantioselective Discrimination in the Intramolecular Quenching of an Excited Aromatic Ketone by a Ground-State Phenol |
Authors of publication | Miguel A. Miranda; Agustin Lahoz; Ramón Martínez-Máñez; Francisco Boscá; José V. Castell; Julia Pérez-Prieto |
Journal of publication | Journal of the American Chemical Society |
Year of publication | 1999 |
Journal volume | 121 |
Pages of publication | 11569 - 11570 |
a | 7.902 ± 0.002 Å |
b | 8.256 ± 0.003 Å |
c | 8.859 ± 0.003 Å |
α | 78.4 ± 0.02° |
β | 76.73 ± 0.02° |
γ | 87.96 ± 0.03° |
Cell volume | 551 ± 0.3 Å3 |
Cell temperature | 298 ± 2 K |
Ambient diffraction temperature | 298 ± 2 K |
Number of distinct elements | 5 |
Space group number | 1 |
Hermann-Mauguin space group symbol | P 1 |
Hall space group symbol | P 1 |
Residual factor for all reflections | 0.0624 |
Residual factor for significantly intense reflections | 0.0327 |
Weighted residual factors for all reflections | 0.1365 |
Weighted residual factors for significantly intense reflections | 0.091 |
Goodness-of-fit parameter for all reflections | 0.89 |
Goodness-of-fit parameter for significantly intense reflections | 0.878 |
Diffraction radiation wavelength | 0.71073 Å |
Diffraction radiation type | MoKα |