Information card for entry 4116627
Formula | C24 H23 N O5 S |
Calculated formula | C24 H23 N O5 S |
SMILES | s1cccc1C(=O)c1ccc(cc1)[C@H](C)C(=O)N[C@H](C(=O)OC)Cc1ccc(O)cc1 |
Title of publication | Enantioselective Discrimination in the Intramolecular Quenching of an Excited Aromatic Ketone by a Ground-State Phenol |
Authors of publication | Miguel A. Miranda; Agustin Lahoz; Ramón Martínez-Máñez; Francisco Boscá; José V. Castell; Julia Pérez-Prieto |
Journal of publication | Journal of the American Chemical Society |
Year of publication | 1999 |
Journal volume | 121 |
Pages of publication | 11569 - 11570 |
a | 8.056 ± 0.005 Å |
b | 8.326 ± 0.005 Å |
c | 8.751 ± 0.006 Å |
α | 77.78 ± 0.05° |
β | 78.13 ± 0.05° |
γ | 89.88 ± 0.05° |
Cell volume | 560.9 ± 0.6 Å3 |
Cell temperature | 293 ± 2 K |
Ambient diffraction temperature | 293 ± 2 K |
Number of distinct elements | 5 |
Space group number | 1 |
Hermann-Mauguin space group symbol | P 1 |
Hall space group symbol | P 1 |
Residual factor for all reflections | 0.0532 |
Residual factor for significantly intense reflections | 0.049 |
Weighted residual factors for all reflections | 0.1319 |
Weighted residual factors for significantly intense reflections | 0.1271 |
Goodness-of-fit parameter for all reflections | 1.117 |
Goodness-of-fit parameter for significantly intense reflections | 1.124 |
Diffraction radiation wavelength | 0.71073 Å |
Diffraction radiation type | MoKα |