Information card for entry 4116628
Formula | C23 H21 N O5 S |
Calculated formula | C24 H23 N O5 S |
SMILES | s1c(C(=O)c2ccccc2)ccc1[C@@H](C)C(=O)N[C@H](C(=O)OC)Cc1ccc(O)cc1 |
Title of publication | Enantioselective Discrimination in the Intramolecular Quenching of an Excited Aromatic Ketone by a Ground-State Phenol |
Authors of publication | Miguel A. Miranda; Agustin Lahoz; Ramón Martínez-Máñez; Francisco Boscá; José V. Castell; Julia Pérez-Prieto |
Journal of publication | Journal of the American Chemical Society |
Year of publication | 1999 |
Journal volume | 121 |
Pages of publication | 11569 - 11570 |
a | 7.889 ± 0.005 Å |
b | 8.294 ± 0.005 Å |
c | 8.727 ± 0.005 Å |
α | 79.7 ± 0.05° |
β | 74.71 ± 0.04° |
γ | 87.15 ± 0.05° |
Cell volume | 541.9 ± 0.6 Å3 |
Cell temperature | 298 ± 2 K |
Ambient diffraction temperature | 298 ± 2 K |
Number of distinct elements | 5 |
Space group number | 1 |
Hermann-Mauguin space group symbol | P 1 |
Hall space group symbol | P 1 |
Residual factor for all reflections | 0.0319 |
Residual factor for significantly intense reflections | 0.0297 |
Weighted residual factors for all reflections | 0.0874 |
Weighted residual factors for significantly intense reflections | 0.0835 |
Goodness-of-fit parameter for all reflections | 0.815 |
Goodness-of-fit parameter for significantly intense reflections | 0.8 |
Diffraction radiation wavelength | 0.71073 Å |
Diffraction radiation type | MoKα |