Information card for entry 4122427
Formula | Cl5 Ge2 Na O80 Sn9 W18 |
Calculated formula | Cl5 Ge2 Na O80 Sn9 W18 |
Title of publication | All-Inorganic Networks and Tetramer Based on Tin(II)-Containing Polyoxometalates: Tuning Structural and Spectral Properties with Lone-Pairs. |
Authors of publication | Zhao, Chongchao; Glass, Elliot N.; Chica, Bryant; Musaev, Djamaladdin G.; Sumliner, Jordan M.; Dyer, R. Brian; Lian, Tianquan; Hill, Craig L. |
Journal of publication | Journal of the American Chemical Society |
Year of publication | 2014 |
Journal volume | 136 |
Journal issue | 34 |
Pages of publication | 12085 |
a | 21.416 ± 0.003 Å |
b | 21.416 ± 0.003 Å |
c | 23.133 ± 0.003 Å |
α | 90° |
β | 90° |
γ | 90° |
Cell volume | 10610 ± 3 Å3 |
Cell temperature | 173 ± 2 K |
Ambient diffraction temperature | 173 ± 2 K |
Number of distinct elements | 6 |
Space group number | 138 |
Hermann-Mauguin space group symbol | P 42/n c m :2 |
Hall space group symbol | -P 4ac 2ac |
Residual factor for all reflections | 0.1043 |
Residual factor for significantly intense reflections | 0.0666 |
Weighted residual factors for significantly intense reflections | 0.1516 |
Weighted residual factors for all reflections included in the refinement | 0.1747 |
Goodness-of-fit parameter for all reflections included in the refinement | 1.177 |
Diffraction radiation wavelength | 0.71073 Å |
Diffraction radiation type | MoKα |