Information card for entry 4122428
Formula | Na9 O77.5 Sb2 Sn6 W18 |
Calculated formula | Na9 O78.47 Sb2 Sn6 W18 |
Title of publication | All-Inorganic Networks and Tetramer Based on Tin(II)-Containing Polyoxometalates: Tuning Structural and Spectral Properties with Lone-Pairs. |
Authors of publication | Zhao, Chongchao; Glass, Elliot N.; Chica, Bryant; Musaev, Djamaladdin G.; Sumliner, Jordan M.; Dyer, R. Brian; Lian, Tianquan; Hill, Craig L. |
Journal of publication | Journal of the American Chemical Society |
Year of publication | 2014 |
Journal volume | 136 |
Journal issue | 34 |
Pages of publication | 12085 |
a | 17.778 ± 0.003 Å |
b | 17.778 ± 0.003 Å |
c | 45.221 ± 0.013 Å |
α | 90° |
β | 90° |
γ | 120° |
Cell volume | 12378 ± 5 Å3 |
Cell temperature | 293 ± 2 K |
Ambient diffraction temperature | 293 ± 2 K |
Number of distinct elements | 5 |
Space group number | 166 |
Hermann-Mauguin space group symbol | R -3 m :H |
Hall space group symbol | -R 3 2" |
Residual factor for all reflections | 0.1204 |
Residual factor for significantly intense reflections | 0.068 |
Weighted residual factors for significantly intense reflections | 0.1841 |
Weighted residual factors for all reflections included in the refinement | 0.2252 |
Goodness-of-fit parameter for all reflections included in the refinement | 0.998 |
Diffraction radiation wavelength | 0.71073 Å |
Diffraction radiation type | MoKα |