Information card for entry 4122429
Formula | C121 H133 N10 V2 |
Calculated formula | C121 H133 N10 V2 |
Title of publication | N-N Bond Cleavage of 1,2-Diarylhydrazines and N-H Bond Formation via H-Atom Transfer in Vanadium Complexes Supported by a Redox-Active Ligand. |
Authors of publication | Milsmann, Carsten; Semproni, Scott P.; Chirik, Paul J. |
Journal of publication | Journal of the American Chemical Society |
Year of publication | 2014 |
Journal volume | 136 |
Journal issue | 34 |
Pages of publication | 12099 |
a | 11.567 ± 0.005 Å |
b | 24.266 ± 0.005 Å |
c | 18.216 ± 0.005 Å |
α | 90° |
β | 95.568 ± 0.005° |
γ | 90° |
Cell volume | 5089 ± 3 Å3 |
Cell temperature | 100 ± 2 K |
Ambient diffraction temperature | 100 ± 2 K |
Number of distinct elements | 4 |
Space group number | 14 |
Hermann-Mauguin space group symbol | P 1 21/c 1 |
Hall space group symbol | -P 2ybc |
Residual factor for all reflections | 0.0553 |
Residual factor for significantly intense reflections | 0.0413 |
Weighted residual factors for significantly intense reflections | 0.1033 |
Weighted residual factors for all reflections included in the refinement | 0.1108 |
Goodness-of-fit parameter for all reflections included in the refinement | 1.024 |
Diffraction radiation wavelength | 1.54184 Å |
Diffraction radiation type | CuKα |