Information card for entry 4127585
Formula | C38 H30 Cl F24 N5 P2 |
Calculated formula | C38 H30 Cl F24 N5 P2 |
Title of publication | Tailoring the Binding Properties of Phosphazane Anion Receptors and Transporters. |
Authors of publication | Plajer, Alex J.; Zhu, Jinbo; Proehm, Patrick; Bond, Andrew D.; Keyser, Ulrich F.; Wright, Dominic S. |
Journal of publication | Journal of the American Chemical Society |
Year of publication | 2019 |
Journal volume | 141 |
Journal issue | 22 |
Pages of publication | 8807 - 8815 |
a | 12.4964 ± 0.0004 Å |
b | 13.1178 ± 0.0004 Å |
c | 15.3713 ± 0.0005 Å |
α | 87.935 ± 0.002° |
β | 82.314 ± 0.002° |
γ | 67.01 ± 0.002° |
Cell volume | 2298.41 ± 0.13 Å3 |
Cell temperature | 180 ± 2 K |
Ambient diffraction temperature | 180 ± 2 K |
Number of distinct elements | 6 |
Space group number | 2 |
Hermann-Mauguin space group symbol | P -1 |
Hall space group symbol | -P 1 |
Residual factor for all reflections | 0.0792 |
Residual factor for significantly intense reflections | 0.0632 |
Weighted residual factors for significantly intense reflections | 0.1583 |
Weighted residual factors for all reflections included in the refinement | 0.1733 |
Goodness-of-fit parameter for all reflections included in the refinement | 1.037 |
Diffraction radiation wavelength | 1.54178 Å |
Diffraction radiation type | CuKα |