Information card for entry 4127586
Formula | C30 H42 Au2 Cl3 F12 N5 P2 |
Calculated formula | C30 H42 Au2 Cl3 F12 N5 P2 |
Title of publication | Tailoring the Binding Properties of Phosphazane Anion Receptors and Transporters. |
Authors of publication | Plajer, Alex J.; Zhu, Jinbo; Proehm, Patrick; Bond, Andrew D.; Keyser, Ulrich F.; Wright, Dominic S. |
Journal of publication | Journal of the American Chemical Society |
Year of publication | 2019 |
Journal volume | 141 |
Journal issue | 22 |
Pages of publication | 8807 - 8815 |
a | 13.9922 ± 0.0004 Å |
b | 14.11 ± 0.0004 Å |
c | 21.4076 ± 0.0006 Å |
α | 90° |
β | 93.5574 ± 0.0014° |
γ | 90° |
Cell volume | 4218.4 ± 0.2 Å3 |
Cell temperature | 180 ± 2 K |
Ambient diffraction temperature | 180 ± 2 K |
Number of distinct elements | 7 |
Space group number | 14 |
Hermann-Mauguin space group symbol | P 1 21/n 1 |
Hall space group symbol | -P 2yn |
Residual factor for all reflections | 0.0459 |
Residual factor for significantly intense reflections | 0.0296 |
Weighted residual factors for significantly intense reflections | 0.0527 |
Weighted residual factors for all reflections included in the refinement | 0.057 |
Goodness-of-fit parameter for all reflections included in the refinement | 1.013 |
Diffraction radiation wavelength | 1.54178 Å |
Diffraction radiation type | CuKα |