Information card for entry 4127591
Formula | C65 H64 Br2 Cl2 N4 O3 Ru |
Calculated formula | C63 H58 Br2 N4 O2 Ru |
Title of publication | Ruthenium(II) Porphyrin Quinoid Carbene Complexes: Synthesis, Crystal Structure, and Reactivity toward Carbene Transfer and Hydrogen Atom Transfer Reactions. |
Authors of publication | Wang, Hai-Xu; Wan, Qingyun; Wu, Kai; Low, Kam-Hung; Yang, Chen; Zhou, Cong-Ying; Huang, Jie-Sheng; Che, Chi-Ming |
Journal of publication | Journal of the American Chemical Society |
Year of publication | 2019 |
Journal volume | 141 |
Journal issue | 22 |
Pages of publication | 9027 - 9046 |
a | 15.9947 ± 0.0017 Å |
b | 19.257 ± 0.002 Å |
c | 19.861 ± 0.002 Å |
α | 90° |
β | 95.902 ± 0.004° |
γ | 90° |
Cell volume | 6085 ± 1.1 Å3 |
Cell temperature | 200 ± 2 K |
Ambient diffraction temperature | 200 ± 2 K |
Number of distinct elements | 7 |
Space group number | 14 |
Hermann-Mauguin space group symbol | P 1 21/n 1 |
Hall space group symbol | -P 2yn |
Residual factor for all reflections | 0.133 |
Residual factor for significantly intense reflections | 0.1055 |
Weighted residual factors for significantly intense reflections | 0.2264 |
Weighted residual factors for all reflections included in the refinement | 0.2385 |
Goodness-of-fit parameter for all reflections included in the refinement | 1.113 |
Diffraction radiation wavelength | 1.34138 Å |
Diffraction radiation type | GaKα |