Information card for entry 4127592
Formula | C20 H22 N2 O2 |
Calculated formula | C20 H22 N2 O2 |
SMILES | N1(C(=O)[C@@H](N(C(=O)[C@@H]1Cc1ccccc1)C)Cc1ccccc1)C |
Title of publication | Ir-Catalyzed Double Asymmetric Hydrogenation of 3,6-Dialkylidene-2,5-diketopiperazines for Enantioselective Synthesis of Cyclic Dipeptides. |
Authors of publication | Ge, Yao; Han, Zhaobin; Wang, Zheng; Ding, Kuiling |
Journal of publication | Journal of the American Chemical Society |
Year of publication | 2019 |
Journal volume | 141 |
Journal issue | 22 |
Pages of publication | 8981 - 8988 |
a | 8.2926 ± 0.0018 Å |
b | 8.5989 ± 0.0018 Å |
c | 24.551 ± 0.006 Å |
α | 90° |
β | 90° |
γ | 90° |
Cell volume | 1750.7 ± 0.7 Å3 |
Cell temperature | 293 ± 2 K |
Ambient diffraction temperature | 293 ± 2 K |
Number of distinct elements | 4 |
Space group number | 19 |
Hermann-Mauguin space group symbol | P 21 21 21 |
Hall space group symbol | P 2ac 2ab |
Residual factor for all reflections | 0.0561 |
Residual factor for significantly intense reflections | 0.0443 |
Weighted residual factors for significantly intense reflections | 0.1064 |
Weighted residual factors for all reflections included in the refinement | 0.1136 |
Goodness-of-fit parameter for all reflections included in the refinement | 1.036 |
Diffraction radiation wavelength | 0.71073 Å |
Diffraction radiation type | MoKα |