Information card for entry 4127613
Formula | C42 H76 Br2 N4 Sc2 |
Calculated formula | C42 H76 Br2 N4 Sc2 |
Title of publication | Scandium-Promoted Direct Conversion of Dinitrogen into Hydrazine Derivatives via N-C Bond Formation. |
Authors of publication | Lv, Ze-Jie; Huang, Zhe; Zhang, Wen-Xiong; Xi, Zhenfeng |
Journal of publication | Journal of the American Chemical Society |
Year of publication | 2019 |
Journal volume | 141 |
Journal issue | 22 |
Pages of publication | 8773 - 8777 |
a | 9.6328 ± 0.0003 Å |
b | 13.6495 ± 0.0004 Å |
c | 17.778 ± 0.0005 Å |
α | 90° |
β | 100.739 ± 0.003° |
γ | 90° |
Cell volume | 2296.56 ± 0.12 Å3 |
Cell temperature | 180 ± 0.1 K |
Ambient diffraction temperature | 180 ± 0.1 K |
Number of distinct elements | 5 |
Space group number | 14 |
Hermann-Mauguin space group symbol | P 1 21/n 1 |
Hall space group symbol | -P 2yn |
Residual factor for all reflections | 0.0345 |
Residual factor for significantly intense reflections | 0.0304 |
Weighted residual factors for significantly intense reflections | 0.0863 |
Weighted residual factors for all reflections included in the refinement | 0.0888 |
Goodness-of-fit parameter for all reflections included in the refinement | 1.053 |
Diffraction radiation probe | x-ray |
Diffraction radiation wavelength | 0.71073 Å |
Diffraction radiation type | MoKα |