Information card for entry 4127614
Formula | C45 H82 N6 O Sc2 |
Calculated formula | C45 H82 N6 O Sc2 |
Title of publication | Scandium-Promoted Direct Conversion of Dinitrogen into Hydrazine Derivatives via N-C Bond Formation. |
Authors of publication | Lv, Ze-Jie; Huang, Zhe; Zhang, Wen-Xiong; Xi, Zhenfeng |
Journal of publication | Journal of the American Chemical Society |
Year of publication | 2019 |
Journal volume | 141 |
Journal issue | 22 |
Pages of publication | 8773 - 8777 |
a | 10.3715 ± 0.0002 Å |
b | 32.6101 ± 0.0007 Å |
c | 14.2088 ± 0.0003 Å |
α | 90° |
β | 98.785 ± 0.002° |
γ | 90° |
Cell volume | 4749.26 ± 0.17 Å3 |
Cell temperature | 180 ± 0.1 K |
Ambient diffraction temperature | 180 ± 0.1 K |
Number of distinct elements | 5 |
Space group number | 14 |
Hermann-Mauguin space group symbol | P 1 21/n 1 |
Hall space group symbol | -P 2yn |
Residual factor for all reflections | 0.0749 |
Residual factor for significantly intense reflections | 0.0613 |
Weighted residual factors for significantly intense reflections | 0.1412 |
Weighted residual factors for all reflections included in the refinement | 0.1486 |
Goodness-of-fit parameter for all reflections included in the refinement | 1.056 |
Diffraction radiation probe | x-ray |
Diffraction radiation wavelength | 0.71073 Å |
Diffraction radiation type | MoKα |