Information card for entry 4127615
Formula | C20 H16 O2 S Se |
Calculated formula | C20 H16 O2 S Se |
Title of publication | Three-Component Regio- and Stereoselective Polymerizations toward Functional Chalcogen-Rich Polymers with AIE-Activities. |
Authors of publication | Gao, Qingqing; Xiong, Ling-Hong; Han, Ting; Qiu, Zijie; He, Xuewen; Sung, Herman H. Y.; Kwok, Ryan T. K.; Williams, Ian D.; Lam, Jacky W. Y.; Tang, Ben Zhong |
Journal of publication | Journal of the American Chemical Society |
Year of publication | 2019 |
Journal volume | 141 |
Journal issue | 37 |
Pages of publication | 14712 - 14719 |
a | 15.9736 ± 0.0003 Å |
b | 5.3198 ± 0.0001 Å |
c | 20.0252 ± 0.0004 Å |
α | 90° |
β | 96.278 ± 0.002° |
γ | 90° |
Cell volume | 1691.46 ± 0.06 Å3 |
Cell temperature | 100.01 ± 0.1 K |
Ambient diffraction temperature | 100.01 ± 0.1 K |
Number of distinct elements | 5 |
Space group number | 14 |
Hermann-Mauguin space group symbol | P 1 21/c 1 |
Hall space group symbol | -P 2ybc |
Residual factor for all reflections | 0.0303 |
Residual factor for significantly intense reflections | 0.0259 |
Weighted residual factors for significantly intense reflections | 0.0593 |
Weighted residual factors for all reflections included in the refinement | 0.0613 |
Goodness-of-fit parameter for all reflections included in the refinement | 1.029 |
Diffraction radiation probe | x-ray |
Diffraction radiation wavelength | 1.54184 Å |
Diffraction radiation type | CuKα |