Information card for entry 4127719
Formula | C34.31 H25.65 Cl0.74 N2.97 O3 |
Calculated formula | C34.31 H25.648 Cl0.732 N2.972 O3 |
Title of publication | Electrostatically Driven CO-π Aromatic Interactions. |
Authors of publication | Li, Ping; Vik, Erik C.; Maier, Josef M.; Karki, Ishwor; Strickland, Sharon M. S.; Umana, Jessica M.; Smith, Mark D.; Pellechia, Perry J.; Shimizu, Ken D. |
Journal of publication | Journal of the American Chemical Society |
Year of publication | 2019 |
Journal volume | 141 |
Journal issue | 32 |
Pages of publication | 12513 - 12517 |
a | 6.9786 ± 0.0006 Å |
b | 13.7874 ± 0.0011 Å |
c | 14.798 ± 0.0012 Å |
α | 104.496 ± 0.004° |
β | 94.554 ± 0.005° |
γ | 97.803 ± 0.005° |
Cell volume | 1356.1 ± 0.2 Å3 |
Cell temperature | 100 ± 2 K |
Ambient diffraction temperature | 100 ± 2 K |
Number of distinct elements | 5 |
Space group number | 2 |
Hermann-Mauguin space group symbol | P -1 |
Hall space group symbol | -P 1 |
Residual factor for all reflections | 0.0676 |
Residual factor for significantly intense reflections | 0.0479 |
Weighted residual factors for significantly intense reflections | 0.1092 |
Weighted residual factors for all reflections included in the refinement | 0.1166 |
Goodness-of-fit parameter for all reflections included in the refinement | 1.053 |
Diffraction radiation probe | x-ray |
Diffraction radiation wavelength | 0.71073 Å |
Diffraction radiation type | MoKα |