Information card for entry 4127720
Formula | C34 H23 N O3.12 |
Calculated formula | C34 H23 N O3.11633 |
Title of publication | Electrostatically Driven CO-π Aromatic Interactions. |
Authors of publication | Li, Ping; Vik, Erik C.; Maier, Josef M.; Karki, Ishwor; Strickland, Sharon M. S.; Umana, Jessica M.; Smith, Mark D.; Pellechia, Perry J.; Shimizu, Ken D. |
Journal of publication | Journal of the American Chemical Society |
Year of publication | 2019 |
Journal volume | 141 |
Journal issue | 32 |
Pages of publication | 12513 - 12517 |
a | 35.4911 ± 0.0014 Å |
b | 35.4911 ± 0.0014 Å |
c | 9.9547 ± 0.0004 Å |
α | 90° |
β | 90° |
γ | 120° |
Cell volume | 10859.2 ± 0.7 Å3 |
Cell temperature | 100 ± 2 K |
Ambient diffraction temperature | 100 ± 2 K |
Number of distinct elements | 4 |
Space group number | 147 |
Hermann-Mauguin space group symbol | P -3 |
Hall space group symbol | -P 3 |
Residual factor for all reflections | 0.0556 |
Residual factor for significantly intense reflections | 0.0416 |
Weighted residual factors for significantly intense reflections | 0.0899 |
Weighted residual factors for all reflections included in the refinement | 0.0964 |
Goodness-of-fit parameter for all reflections included in the refinement | 1.033 |
Diffraction radiation probe | x-ray |
Diffraction radiation wavelength | 0.71073 Å |
Diffraction radiation type | MoKα |