Information card for entry 4127722
Formula | C7 H16 I7 N3 Pb2 |
Calculated formula | C7 H16 I7 N3 Pb2 |
Title of publication | Two-Dimensional Dion-Jacobson Hybrid Lead Iodide Perovskites with Aromatic Diammonium Cations. |
Authors of publication | Li, Xiaotong; Ke, Weijun; Traoré, Boubacar; Guo, Peijun; Hadar, Ido; Kepenekian, Mikaël; Even, Jacky; Katan, Claudine; Stoumpos, Constantinos C.; Schaller, Richard D.; Kanatzidis, Mercouri G. |
Journal of publication | Journal of the American Chemical Society |
Year of publication | 2019 |
Journal volume | 141 |
Journal issue | 32 |
Pages of publication | 12880 - 12890 |
a | 16.24 ± 0.0007 Å |
b | 9.0384 ± 0.0005 Å |
c | 8.8082 ± 0.0016 Å |
α | 90° |
β | 97.619 ± 0.007° |
γ | 90° |
Cell volume | 1281.5 ± 0.3 Å3 |
Cell temperature | 293 K |
Ambient diffraction temperature | 293 K |
Number of distinct elements | 5 |
Space group number | 7 |
Hermann-Mauguin space group symbol | P 1 c 1 |
Hall space group symbol | P -2yc |
Residual factor for all reflections | 0.1281 |
Residual factor for significantly intense reflections | 0.0944 |
Weighted residual factors for significantly intense reflections | 0.164 |
Weighted residual factors for all reflections included in the refinement | 0.1676 |
Goodness-of-fit parameter for significantly intense reflections | 3.78 |
Goodness-of-fit parameter for all reflections included in the refinement | 3.17 |
Diffraction radiation probe | x-ray |
Diffraction radiation wavelength | 0.71073 Å |
Diffraction radiation type | MoKα |