Information card for entry 4127721
Formula | C6 H10 I4 N2 Pb |
Calculated formula | C6 H10 I4 N2 Pb |
Title of publication | Two-Dimensional Dion-Jacobson Hybrid Lead Iodide Perovskites with Aromatic Diammonium Cations. |
Authors of publication | Li, Xiaotong; Ke, Weijun; Traoré, Boubacar; Guo, Peijun; Hadar, Ido; Kepenekian, Mikaël; Even, Jacky; Katan, Claudine; Stoumpos, Constantinos C.; Schaller, Richard D.; Kanatzidis, Mercouri G. |
Journal of publication | Journal of the American Chemical Society |
Year of publication | 2019 |
Journal volume | 141 |
Journal issue | 32 |
Pages of publication | 12880 - 12890 |
a | 9.1223 ± 0.0013 Å |
b | 8.7787 ± 0.0012 Å |
c | 19.83 ± 0.004 Å |
α | 90° |
β | 90.103 ± 0.013° |
γ | 90° |
Cell volume | 1588 ± 0.4 Å3 |
Cell temperature | 293 K |
Ambient diffraction temperature | 293 K |
Number of distinct elements | 5 |
Space group number | 7 |
Hermann-Mauguin space group symbol | P 1 n 1 |
Hall space group symbol | P -2yac |
Residual factor for all reflections | 0.1616 |
Residual factor for significantly intense reflections | 0.1219 |
Weighted residual factors for significantly intense reflections | 0.132 |
Weighted residual factors for all reflections included in the refinement | 0.1346 |
Goodness-of-fit parameter for significantly intense reflections | 7.17 |
Goodness-of-fit parameter for all reflections included in the refinement | 6.19 |
Diffraction radiation probe | x-ray |
Diffraction radiation wavelength | 0.71073 Å |
Diffraction radiation type | MoKα |