Information card for entry 4127749
Common name | U19 |
Formula | C24 H16 K22.69 O151.5 P8 U18.61 |
Calculated formula | C24 H16 K22.692 O151.5 P8 U18.608 |
Title of publication | Supramolecular Assembly of Geometrically Unstable Hybrid Organic-Inorganic Uranyl Peroxide Cage Clusters and Their Transformations. |
Authors of publication | Xu, Mengyu; Traustason, Hrafn; Bo, Fabrice Dal; Hickam, Sarah; Chong, Saehwa; Zhang, Lei; Oliver, Allen G.; Burns, Peter C. |
Journal of publication | Journal of the American Chemical Society |
Year of publication | 2019 |
Journal volume | 141 |
Journal issue | 32 |
Pages of publication | 12780 - 12788 |
a | 19.099 ± 0.004 Å |
b | 25.697 ± 0.005 Å |
c | 19.253 ± 0.004 Å |
α | 90° |
β | 91.374 ± 0.003° |
γ | 90° |
Cell volume | 9446 ± 3 Å3 |
Cell temperature | 160 ± 2 K |
Ambient diffraction temperature | 160 ± 2 K |
Number of distinct elements | 6 |
Space group number | 4 |
Hermann-Mauguin space group symbol | P 1 21 1 |
Hall space group symbol | P 2yb |
Residual factor for all reflections | 0.0875 |
Residual factor for significantly intense reflections | 0.0605 |
Weighted residual factors for significantly intense reflections | 0.1438 |
Weighted residual factors for all reflections included in the refinement | 0.159 |
Goodness-of-fit parameter for all reflections included in the refinement | 1.02 |
Diffraction radiation wavelength | 0.71073 Å |
Diffraction radiation type | MoKα |