Information card for entry 4127750
Common name | U24 |
Formula | C0 H0 K26.92 O159 P0 U24 |
Calculated formula | K27.024 O158.98 U24 |
Title of publication | Supramolecular Assembly of Geometrically Unstable Hybrid Organic-Inorganic Uranyl Peroxide Cage Clusters and Their Transformations. |
Authors of publication | Xu, Mengyu; Traustason, Hrafn; Bo, Fabrice Dal; Hickam, Sarah; Chong, Saehwa; Zhang, Lei; Oliver, Allen G.; Burns, Peter C. |
Journal of publication | Journal of the American Chemical Society |
Year of publication | 2019 |
Journal volume | 141 |
Journal issue | 32 |
Pages of publication | 12780 - 12788 |
a | 19.6881 ± 0.0013 Å |
b | 19.6881 ± 0.0013 Å |
c | 19.0607 ± 0.0018 Å |
α | 90° |
β | 90° |
γ | 90° |
Cell volume | 7388.3 ± 1 Å3 |
Cell temperature | 160 ± 2 K |
Ambient diffraction temperature | 160 ± 2 K |
Number of distinct elements | 6 |
Space group number | 87 |
Hermann-Mauguin space group symbol | I 4/m |
Hall space group symbol | -I 4 |
Residual factor for all reflections | 0.0256 |
Residual factor for significantly intense reflections | 0.021 |
Weighted residual factors for significantly intense reflections | 0.0462 |
Weighted residual factors for all reflections included in the refinement | 0.0474 |
Goodness-of-fit parameter for all reflections included in the refinement | 1.05 |
Diffraction radiation wavelength | 0.71073 Å |
Diffraction radiation type | MoKα |