Information card for entry 4127758
Formula | C10 H14 O3 |
Calculated formula | C10 H14 O3 |
SMILES | O=C1C[C@@H]2OC[C@@H]3[C@@H]([C@]2(OC3)C)C1 |
Title of publication | Rhodium(III)-Catalyzed Asymmetric Borylative Cyclization of Cyclohexadienone-Containing 1,6-Dienes: An Experimental and DFT Study. |
Authors of publication | Tan, Yun-Xuan; Zhang, Fang; Xie, Pei-Pei; Zhang, Shuo-Qing; Wang, Yi-Fan; Li, Qing-Hua; Tian, Ping; Hong, Xin; Lin, Guo-Qiang |
Journal of publication | Journal of the American Chemical Society |
Year of publication | 2019 |
Journal volume | 141 |
Journal issue | 32 |
Pages of publication | 12770 - 12779 |
a | 6.9327 ± 0.0004 Å |
b | 7.3133 ± 0.0004 Å |
c | 8.9299 ± 0.0005 Å |
α | 90° |
β | 95.124 ± 0.002° |
γ | 90° |
Cell volume | 450.94 ± 0.04 Å3 |
Cell temperature | 296 ± 2 K |
Ambient diffraction temperature | 296 ± 2 K |
Number of distinct elements | 3 |
Space group number | 4 |
Hermann-Mauguin space group symbol | P 1 21 1 |
Hall space group symbol | P 2yb |
Residual factor for all reflections | 0.0306 |
Residual factor for significantly intense reflections | 0.0305 |
Weighted residual factors for significantly intense reflections | 0.0872 |
Weighted residual factors for all reflections included in the refinement | 0.0874 |
Goodness-of-fit parameter for all reflections included in the refinement | 1.031 |
Diffraction radiation wavelength | 1.54178 Å |
Diffraction radiation type | CuKα |