Information card for entry 4127759
Formula | C16 H25 B O4 |
Calculated formula | C16 H25 B O4 |
Title of publication | Rhodium(III)-Catalyzed Asymmetric Borylative Cyclization of Cyclohexadienone-Containing 1,6-Dienes: An Experimental and DFT Study. |
Authors of publication | Tan, Yun-Xuan; Zhang, Fang; Xie, Pei-Pei; Zhang, Shuo-Qing; Wang, Yi-Fan; Li, Qing-Hua; Tian, Ping; Hong, Xin; Lin, Guo-Qiang |
Journal of publication | Journal of the American Chemical Society |
Year of publication | 2019 |
Journal volume | 141 |
Journal issue | 32 |
Pages of publication | 12770 - 12779 |
a | 6.7144 ± 0.0002 Å |
b | 11.6764 ± 0.0003 Å |
c | 10.844 ± 0.0003 Å |
α | 90° |
β | 101.962 ± 0.001° |
γ | 90° |
Cell volume | 831.71 ± 0.04 Å3 |
Cell temperature | 293 ± 2 K |
Ambient diffraction temperature | 293 ± 2 K |
Number of distinct elements | 4 |
Space group number | 4 |
Hermann-Mauguin space group symbol | P 1 21 1 |
Hall space group symbol | P 2yb |
Residual factor for all reflections | 0.0501 |
Residual factor for significantly intense reflections | 0.0479 |
Weighted residual factors for significantly intense reflections | 0.1277 |
Weighted residual factors for all reflections included in the refinement | 0.1312 |
Goodness-of-fit parameter for all reflections included in the refinement | 1.074 |
Diffraction radiation wavelength | 1.54178 Å |
Diffraction radiation type | CuKα |