Information card for entry 4127763
Common name | TA-MAPB |
Formula | C66.5 H52 N2 |
Calculated formula | C66.5 H52 N2 |
Title of publication | Switching on and off Interlayer Correlations and Porosity in 2D Covalent Organic Frameworks. |
Authors of publication | Sick, Torben; Rotter, Julian M.; Reuter, Stephan; Kandambeth, Sharath; Bach, Nicolai N.; Döblinger, Markus; Merz, Julia; Clark, Timothy; Marder, Todd B.; Bein, Thomas; Medina, Dana D. |
Journal of publication | Journal of the American Chemical Society |
Year of publication | 2019 |
Journal volume | 141 |
Journal issue | 32 |
Pages of publication | 12570 - 12581 |
a | 9.962 ± 0.0004 Å |
b | 13.7057 ± 0.0005 Å |
c | 18.6233 ± 0.0007 Å |
α | 89.038 ± 0.001° |
β | 78.249 ± 0.001° |
γ | 74.177 ± 0.002° |
Cell volume | 2393.11 ± 0.16 Å3 |
Cell temperature | 103 ± 2 K |
Ambient diffraction temperature | 103 ± 2 K |
Number of distinct elements | 3 |
Space group number | 2 |
Hermann-Mauguin space group symbol | P -1 |
Hall space group symbol | -P 1 |
Residual factor for all reflections | 0.0915 |
Residual factor for significantly intense reflections | 0.0664 |
Weighted residual factors for significantly intense reflections | 0.1654 |
Weighted residual factors for all reflections included in the refinement | 0.1816 |
Goodness-of-fit parameter for all reflections included in the refinement | 1.033 |
Diffraction radiation wavelength | 0.71073 Å |
Diffraction radiation type | MoKα |