Information card for entry 4127764
Common name | TS461 BDTOMe MAPB |
Formula | C62 H44 N2 O2 S2 |
Calculated formula | C62 H44 N2 O2 S2 |
Title of publication | Switching on and off Interlayer Correlations and Porosity in 2D Covalent Organic Frameworks. |
Authors of publication | Sick, Torben; Rotter, Julian M.; Reuter, Stephan; Kandambeth, Sharath; Bach, Nicolai N.; Döblinger, Markus; Merz, Julia; Clark, Timothy; Marder, Todd B.; Bein, Thomas; Medina, Dana D. |
Journal of publication | Journal of the American Chemical Society |
Year of publication | 2019 |
Journal volume | 141 |
Journal issue | 32 |
Pages of publication | 12570 - 12581 |
a | 10.0992 ± 0.0005 Å |
b | 12.3535 ± 0.0006 Å |
c | 25.0363 ± 0.0009 Å |
α | 85.671 ± 0.002° |
β | 80.923 ± 0.002° |
γ | 78.079 ± 0.002° |
Cell volume | 3014.9 ± 0.2 Å3 |
Cell temperature | 100 ± 2 K |
Ambient diffraction temperature | 100 ± 2 K |
Number of distinct elements | 5 |
Space group number | 2 |
Hermann-Mauguin space group symbol | P -1 |
Hall space group symbol | -P 1 |
Residual factor for all reflections | 0.1178 |
Residual factor for significantly intense reflections | 0.0739 |
Weighted residual factors for significantly intense reflections | 0.2091 |
Weighted residual factors for all reflections included in the refinement | 0.2268 |
Goodness-of-fit parameter for all reflections included in the refinement | 0.971 |
Diffraction radiation wavelength | 0.71073 Å |
Diffraction radiation type | MoKα |