Information card for entry 4127781
Common name | MAACCuCz |
Formula | C42 H50 Cu N3 O |
Calculated formula | C42 H50 Cu N3 O |
Title of publication | Highly Efficient Photo- and Electroluminescence from Two-Coordinate Cu(I) Complexes Featuring Nonconventional N-Heterocyclic Carbenes. |
Authors of publication | Shi, Shuyang; Jung, Moon Chul; Coburn, Caleb; Tadle, Abegail; Sylvinson M R, Daniel; Djurovich, Peter I.; Forrest, Stephen R.; Thompson, Mark E. |
Journal of publication | Journal of the American Chemical Society |
Year of publication | 2019 |
Journal volume | 141 |
Journal issue | 8 |
Pages of publication | 3576 - 3588 |
a | 13.515 ± 0.007 Å |
b | 23.275 ± 0.012 Å |
c | 13.016 ± 0.007 Å |
α | 90° |
β | 113.2 ± 0.008° |
γ | 90° |
Cell volume | 3763 ± 3 Å3 |
Cell temperature | 100 ± 2 K |
Ambient diffraction temperature | 100 ± 2 K |
Number of distinct elements | 5 |
Space group number | 14 |
Hermann-Mauguin space group symbol | P 1 21/c 1 |
Hall space group symbol | -P 2ybc |
Residual factor for all reflections | 0.1061 |
Residual factor for significantly intense reflections | 0.0795 |
Weighted residual factors for significantly intense reflections | 0.1607 |
Weighted residual factors for all reflections included in the refinement | 0.1687 |
Goodness-of-fit parameter for all reflections included in the refinement | 1.267 |
Diffraction radiation wavelength | 0.71073 Å |
Diffraction radiation type | MoKα |