Information card for entry 4127782
Common name | MAACCuCzCN |
Formula | C43 H47 Cu N4 O |
Calculated formula | C43 H47 Cu N4 O |
Title of publication | Highly Efficient Photo- and Electroluminescence from Two-Coordinate Cu(I) Complexes Featuring Nonconventional N-Heterocyclic Carbenes. |
Authors of publication | Shi, Shuyang; Jung, Moon Chul; Coburn, Caleb; Tadle, Abegail; Sylvinson M R, Daniel; Djurovich, Peter I.; Forrest, Stephen R.; Thompson, Mark E. |
Journal of publication | Journal of the American Chemical Society |
Year of publication | 2019 |
Journal volume | 141 |
Journal issue | 8 |
Pages of publication | 3576 - 3588 |
a | 16.236 ± 0.005 Å |
b | 23.108 ± 0.006 Å |
c | 21.854 ± 0.006 Å |
α | 90° |
β | 98.613 ± 0.006° |
γ | 90° |
Cell volume | 8107 ± 4 Å3 |
Cell temperature | 100 ± 2 K |
Ambient diffraction temperature | 100 ± 2 K |
Number of distinct elements | 5 |
Space group number | 15 |
Hermann-Mauguin space group symbol | C 1 2/c 1 |
Hall space group symbol | -C 2yc |
Residual factor for all reflections | 0.0477 |
Residual factor for significantly intense reflections | 0.0419 |
Weighted residual factors for significantly intense reflections | 0.0996 |
Weighted residual factors for all reflections included in the refinement | 0.1018 |
Goodness-of-fit parameter for all reflections included in the refinement | 1.119 |
Diffraction radiation wavelength | 0.71073 Å |
Diffraction radiation type | MoKα |