Information card for entry 4127824
Formula | C116 H266 K8 N32 O P8 |
Calculated formula | C116 H266 K8 N32 O0.5 P8 |
Title of publication | Design, Isolation, and Spectroscopic Analysis of a Tetravalent Terbium Complex. |
Authors of publication | Rice, Natalie T.; Popov, Ivan A.; Russo, Dominic R.; Bacsa, John; Batista, Enrique R.; Yang, Ping; Telser, Joshua; La Pierre, Henry S. |
Journal of publication | Journal of the American Chemical Society |
Year of publication | 2019 |
Journal volume | 141 |
Journal issue | 33 |
Pages of publication | 13222 - 13233 |
a | 22.6075 ± 0.0003 Å |
b | 14.13495 ± 0.00015 Å |
c | 24.5014 ± 0.0003 Å |
α | 90° |
β | 105.367 ± 0.0012° |
γ | 90° |
Cell volume | 7549.65 ± 0.16 Å3 |
Cell temperature | 100 ± 2 K |
Ambient diffraction temperature | 100 ± 2 K |
Number of distinct elements | 6 |
Space group number | 14 |
Hermann-Mauguin space group symbol | P 1 21/c 1 |
Hall space group symbol | -P 2ybc |
Residual factor for all reflections | 0.055 |
Residual factor for significantly intense reflections | 0.0392 |
Weighted residual factors for significantly intense reflections | 0.0996 |
Weighted residual factors for all reflections included in the refinement | 0.1054 |
Goodness-of-fit parameter for all reflections included in the refinement | 1.048 |
Diffraction radiation probe | x-ray |
Diffraction radiation wavelength | 0.71073 Å |
Diffraction radiation type | MoKα |