Information card for entry 4127825
Formula | C60 H138 K N16 O P4 Tb |
Calculated formula | C60 H138 K N16 O P4 Tb |
Title of publication | Design, Isolation, and Spectroscopic Analysis of a Tetravalent Terbium Complex. |
Authors of publication | Rice, Natalie T.; Popov, Ivan A.; Russo, Dominic R.; Bacsa, John; Batista, Enrique R.; Yang, Ping; Telser, Joshua; La Pierre, Henry S. |
Journal of publication | Journal of the American Chemical Society |
Year of publication | 2019 |
Journal volume | 141 |
Journal issue | 33 |
Pages of publication | 13222 - 13233 |
a | 22.4833 ± 0.0011 Å |
b | 15.9381 ± 0.0008 Å |
c | 25.5112 ± 0.0016 Å |
α | 90° |
β | 114.512 ± 0.002° |
γ | 90° |
Cell volume | 8317.8 ± 0.8 Å3 |
Cell temperature | 100 ± 2 K |
Ambient diffraction temperature | 100 K |
Number of distinct elements | 7 |
Space group number | 15 |
Hermann-Mauguin space group symbol | C 1 2/c 1 |
Hall space group symbol | -C 2yc |
Residual factor for all reflections | 0.0381 |
Residual factor for significantly intense reflections | 0.0327 |
Weighted residual factors for significantly intense reflections | 0.0863 |
Weighted residual factors for all reflections included in the refinement | 0.0889 |
Goodness-of-fit parameter for all reflections included in the refinement | 1.042 |
Diffraction radiation wavelength | 0.71073 Å |
Diffraction radiation type | MoKα |