Information card for entry 4127835
Formula | C132 H308 Ag44 O44 P22 Pt3 S44 |
Calculated formula | C132 H308 Ag44 O44 P22 Pt3 S44 |
Title of publication | Homoleptic Platinum/Silver Superatoms Protected by Dithiolates: Linear Assemblies of Two and Three Centered Icosahedra Isolobal to Ne<sub>2</sub> and I<sub>3</sub><sup/>. |
Authors of publication | Chiu, Tzu-Hao; Liao, Jian-Hong; Gam, Franck; Chantrenne, Isaac; Kahlal, Samia; Saillard, Jean-Yves; Liu, C. W. |
Journal of publication | Journal of the American Chemical Society |
Year of publication | 2019 |
Journal volume | 141 |
Journal issue | 33 |
Pages of publication | 12957 - 12961 |
a | 19.7461 ± 0.0004 Å |
b | 42.9207 ± 0.0009 Å |
c | 32.3401 ± 0.0006 Å |
α | 90° |
β | 96.5225 ± 0.0005° |
γ | 90° |
Cell volume | 27231.4 ± 0.9 Å3 |
Cell temperature | 150 ± 2 K |
Ambient diffraction temperature | 150 ± 2 K |
Number of distinct elements | 7 |
Space group number | 14 |
Hermann-Mauguin space group symbol | P 1 21/c 1 |
Hall space group symbol | -P 2ybc |
Residual factor for all reflections | 0.0447 |
Residual factor for significantly intense reflections | 0.0282 |
Weighted residual factors for significantly intense reflections | 0.054 |
Weighted residual factors for all reflections included in the refinement | 0.0599 |
Goodness-of-fit parameter for all reflections included in the refinement | 1.035 |
Diffraction radiation wavelength | 0.71073 Å |
Diffraction radiation type | MoKα |