Information card for entry 4127836
Formula | C75 H175 Ag20 O24 P12 Pt S24 |
Calculated formula | C75 H175 Ag20 O24 P12 Pt S24 |
Title of publication | Homoleptic Platinum/Silver Superatoms Protected by Dithiolates: Linear Assemblies of Two and Three Centered Icosahedra Isolobal to Ne<sub>2</sub> and I<sub>3</sub><sup/>. |
Authors of publication | Chiu, Tzu-Hao; Liao, Jian-Hong; Gam, Franck; Chantrenne, Isaac; Kahlal, Samia; Saillard, Jean-Yves; Liu, C. W. |
Journal of publication | Journal of the American Chemical Society |
Year of publication | 2019 |
Journal volume | 141 |
Journal issue | 33 |
Pages of publication | 12957 - 12961 |
a | 30.0959 ± 0.0009 Å |
b | 17.3885 ± 0.0006 Å |
c | 29.7671 ± 0.0009 Å |
α | 90° |
β | 109.472 ± 0.001° |
γ | 90° |
Cell volume | 14686.8 ± 0.8 Å3 |
Cell temperature | 150 ± 2 K |
Ambient diffraction temperature | 150 ± 2 K |
Number of distinct elements | 7 |
Space group number | 14 |
Hermann-Mauguin space group symbol | P 1 21/c 1 |
Hall space group symbol | -P 2ybc |
Residual factor for all reflections | 0.0735 |
Residual factor for significantly intense reflections | 0.0409 |
Weighted residual factors for significantly intense reflections | 0.0796 |
Weighted residual factors for all reflections included in the refinement | 0.0937 |
Goodness-of-fit parameter for all reflections included in the refinement | 1.023 |
Diffraction radiation wavelength | 0.71073 Å |
Diffraction radiation type | MoKα |